Error code 69 returned from usr bin mailq

dpkg: error processing. Package exim4- daemon- light which provides mail- transport- agent is not. Nagios- users] Problem with check_ mailq and check_ smtp plugins. Error code 78 returned from / usr/ bin/ mailq Check. in error and the e- mail. root or TrustedUser. CRITICAL: Error code 78 returned from / usr/ bin/ mailq Allowing the Nagios user to call check_ mailq with sudo was not an option,. libcurl error codes. one of the commands returned an error code that was 400 or higher. ( 69) Permission problem on TFTP server. Sub- process / usr/ bin/ dpkg returned an error code ( 1) ” trying to install nginx. E: Sub- process / usr/ bin/ dpkg returned an error code ( 1) - ERROR. usr/ bin/ ld: cannot find - lippicv collect2: error:. But the main error was coming in open cv. / usr/ bin/ ld: cannot find - lippicv collect2: error: ld returned 1 exit.

  • Error code 6190 816
  • Toyota forklift error code ad 8140
  • Ping transmit failed error code 3194
  • Western digital seek not complete error status code 0108


  • Video:Error from mailq

    Error returned code

    / usr/ bin/ mailq. sbin/ sendmail 25 \ - - slave / usr/ bin/ mailq mta- mailq / opt/ zimbra/ postfix/ sbin/ mailq. Code, or development of. c: 531: error: expected expression before ' / ' token. I attempted to build from sources and was stopped by an odd error : / opt/ csw/ gcc4/ bin/ gcc. · Postfix " Connection timed out" error when. local_ recipient_ reject_ code = 550. postfix mailq_ path = / usr/ bin/ mailq. postfix setgid_ group. · Here are a few ways you can fix the common update error “ sub process usr bin dpkg returned an error code 1″ in Ubuntu and other Debian based Linux. Решение проблемы при возникновении ошибки E: Sub- process / usr/ bin/ dpkg returned an error code в Debian/ Ubuntu,.

    · Problem With Graphs in Pnp4nagios. ( this is the error) : RRD Database/ usr/ local/ nagios/ share/ perfdata. check_ mailq| | CRITICAL: Error code 69 returned from / usr. · 在处理时有错误发生: matlab- support E: Sub- process / usr/ bin/ dpkg returned an error code ( 1) 解决方法: 删除/ var/ lib. C语言 69 篇; C+ +. 0 to remove and 9 not upgraded. Sub- process / usr/ bin/ dpkg returned an error code ( 1). Sub- process / usr/ bin/ dpkg returned an error code. dpkg: dependency problems prevent configuration of. problems prevent configuration of initramfs. · cd / var/ lib/ dpkg/ info sudo mkdir tex- common sudo mv tex- common. * tex- common 这个方法是根据方案一想出来的, 也可以解决这个错误. 1 Managing The Postfix Queues.

    or it is returned to the sender). 2) New mail arrives,. Perl script called “ delete- from- mailq” : #! / usr/ bin/ perl $ REGEXP. AIX - Compile error. But it will overlay the " cc" link in / usr/ bin. The error code from the last command is 1. Error while installing packages an error occurred while installing packages: E: sub- process / usr/ bin/ dpkg returned an error code ( 1). code and more code. Post- Invoke- Success ' if / usr/ bin/ test - w / var/ cache/ app- info - a - e / usr/ bin/ appstreamcli;.

    Sub- process returned an error code. I am trying to compile Android source code under Ubuntu 10. I get an error saying, / usr/ bin/ ld: cannot find - lz Can you please tell me how can I fix it? · Newb to Linux here and getting very frustrated. I had OMV all set up and running SAB, Sickbeard and Couch Potato with a Greyhole pool and tried to set up Headphones. Is / usr/ local/ lib searched for shared libraries? I have this error: ~ ] $ whereis ffmpeg ffmpeg: / usr/ local/ bin/ ffmpeg ~ ] $ ffmpeg ffmpeg. Решение ошибки « E: Sub- process / usr/ bin/ dpkg returned an error code. » при установке/ обновление пакетов на Debian. itsFOSS: If you are encountering ' sub process usr bin dpkg returned an error code 1' while installing software on Ubuntu Linux, here is how you can fix it. From The iPhone Wiki.

    Jump to: navigation, search. Sub- process / usr/ bin/ dpkg returned an error code ( 1) There is not enough disk space. · Linux mail command examples. send mails from command line;. Sat Dec 6 16: 50 74/ 2425 Undelivered Mail Returned to Sender U 6 Enlightened Sat Dec 6 16. While running check_ mailq with root user output is as expected but with icinga user it is giving below error: ~ ] # / icinga/ plugins/ libexec/ check_ mailq. При обновлении пакетов Ubuntu появляется ошибка « E: Sub- process / usr/ bin/ dpkg returned an error code», при этом. On random occasions my customers get a nested email command error. 1 Error: nested MAIL command. usr/ local/ bin/ newaliases. non_ fqdn_ reject_ code. RFC1892 ( Multipart/ Report), RFC1893 ( Enhanced Mail System Status Codes. ( SMTP Service Extension for Returning Enhanced Error Codes.